Reaction Details
TargetD(2) dopamine receptor
LigandBDBM50063277
Substrate/Competitorn/a
Meas. Tech.ChEMBL_59919 (CHEMBL670114)
IC50 79±n/a nM
Citation Wustrow, DBelliotti, TGlase, SKesten, SRJohnson, DColbry, NRubin, RBlackburn, AAkunne, HCorbin, ADavis, MDGeorgic, LWhetzel, SZoski, KHeffner, TPugsley, TWise, L Aminopyrimidines with high affinity for both serotonin and dopamine receptors. J Med Chem41:760-71 (1998) 
 
D(2) dopamine receptor
Name:D(2) dopamine receptor
Type:Cell-surface receptors
Mol. Mass.:50647.10
Organism:Homo sapiens (Human)
Description:P14416
Residue:443
BDBM50063277
NameBDBM50063277
Synonyms:(4-{2-[4-(4-Fluoro-phenyl)-piperazin-1-yl]-ethyl}-cyclohexyl)-pyrimidin-2-yl-amine | CHEMBL349034
TypeSmall organic molecule
Emp. Form.C22H30FN5
Mol. Mass.383.5055
SMILESFc1ccc(cc1)N1CCN(CC[C@H]2CC[C@@H](CC2)Nc2ncccn2)CC1