Reaction Details
TargetD(3) dopamine receptor
LigandBDBM50063279
Substrate/Competitorn/a
Meas. Tech.ChEMBL_62432 (CHEMBL674835)
Ki 0.14±n/a nM
Citation Wustrow, DBelliotti, TGlase, SKesten, SRJohnson, DColbry, NRubin, RBlackburn, AAkunne, HCorbin, ADavis, MDGeorgic, LWhetzel, SZoski, KHeffner, TPugsley, TWise, L Aminopyrimidines with high affinity for both serotonin and dopamine receptors. J Med Chem41:760-71 (1998) 
 
D(3) dopamine receptor
Name:D(3) dopamine receptor
Type:n/a
Mol. Mass.:44243.43
Organism:Homo sapiens (Human)
Description:n/a
Residue:400
BDBM50063279
NameBDBM50063279
Synonyms:CHEMBL309623 | Cyclohexanecarboxylic acid {4-[2-(4-phenyl-piperazin-1-yl)-ethyl]-cyclohexyl}-amide
TypeSmall organic molecule
Emp. Form.C25H39N3O
Mol. Mass.397.5967
SMILESO=C(N[C@H]1CC[C@H](CCN2CCN(CC2)c2ccccc2)CC1)C1CCCCC1