Reaction Details
Target5-hydroxytryptamine receptor 1A
LigandBDBM50063283
Substrate/Competitorn/a
Meas. Tech.ChEMBL_1451 (CHEMBL616575)
Ki 13±n/a nM
Citation Wustrow, DBelliotti, TGlase, SKesten, SRJohnson, DColbry, NRubin, RBlackburn, AAkunne, HCorbin, ADavis, MDGeorgic, LWhetzel, SZoski, KHeffner, TPugsley, TWise, L Aminopyrimidines with high affinity for both serotonin and dopamine receptors. J Med Chem41:760-71 (1998) 
 
5-hydroxytryptamine receptor 1A
Name:5-hydroxytryptamine receptor 1A
Type:G Protein-Coupled Receptor (GPCR)
Mol. Mass.:46445.29
Organism:Rattus norvegicus (rat)
Description:Binding assays were performed using rat hippocampal membranes.
Residue:422
BDBM50063283
NameBDBM50063283
Synonyms:(4-{2-[4-(4-Methoxy-phenyl)-piperazin-1-yl]-ethyl}-cyclohexyl)-pyrimidin-2-yl-amine | CHEMBL351617
TypeSmall organic molecule
Emp. Form.C23H33N5O
Mol. Mass.395.541
SMILESCOc1ccc(cc1)N1CCN(CC[C@H]2CC[C@@H](CC2)Nc2ncccn2)CC1