Reaction Details
Target5-hydroxytryptamine receptor 1A
LigandBDBM50063282
Substrate/Competitorn/a
Meas. Tech.ChEMBL_1451 (CHEMBL616575)
Ki 160±n/a nM
Citation Wustrow, DBelliotti, TGlase, SKesten, SRJohnson, DColbry, NRubin, RBlackburn, AAkunne, HCorbin, ADavis, MDGeorgic, LWhetzel, SZoski, KHeffner, TPugsley, TWise, L Aminopyrimidines with high affinity for both serotonin and dopamine receptors. J Med Chem41:760-71 (1998) 
 
5-hydroxytryptamine receptor 1A
Name:5-hydroxytryptamine receptor 1A
Type:G Protein-Coupled Receptor (GPCR)
Mol. Mass.:46445.29
Organism:Rattus norvegicus (rat)
Description:Binding assays were performed using rat hippocampal membranes.
Residue:422
BDBM50063282
NameBDBM50063282
Synonyms:CHEMBL2110308 | {4-[2-(4-Phenyl-piperazin-1-yl)-ethyl]-cyclohexyl}-pyrimidin-2-yl-amine
TypeSmall organic molecule
Emp. Form.C20H27N5
Mol. Mass.337.4619
SMILESC1CC(CCC1Nc1ncccn1)N1CCN(CC1)c1ccccc1