Reaction Details
TargetD(2) dopamine receptor
LigandBDBM50063286
Substrate/Competitorn/a
Meas. Tech.ChEMBL_60370 (CHEMBL672206)
Ki 25±n/a nM
Citation Wustrow, DBelliotti, TGlase, SKesten, SRJohnson, DColbry, NRubin, RBlackburn, AAkunne, HCorbin, ADavis, MDGeorgic, LWhetzel, SZoski, KHeffner, TPugsley, TWise, L Aminopyrimidines with high affinity for both serotonin and dopamine receptors. J Med Chem41:760-71 (1998) 
 
D(2) dopamine receptor
Name:D(2) dopamine receptor
Type:Cell-surface receptors
Mol. Mass.:50647.10
Organism:Homo sapiens (Human)
Description:P14416
Residue:443
BDBM50063286
NameBDBM50063286
Synonyms:CHEMBL164723 | {4-[2-(4-Pyridin-3-yl-piperazin-1-yl)-ethyl]-cyclohexyl}-pyrimidin-2-yl-amine
TypeSmall organic molecule
Emp. Form.C21H30N6
Mol. Mass.366.5031
SMILESC(CN1CCN(CC1)c1cccnc1)[C@H]1CC[C@@H](CC1)Nc1ncccn1