Reaction Details
TargetD(2) dopamine receptor
LigandBDBM50063298
Substrate/Competitorn/a
Meas. Tech.ChEMBL_60370 (CHEMBL672206)
Ki 11±n/a nM
Citation Wustrow, DBelliotti, TGlase, SKesten, SRJohnson, DColbry, NRubin, RBlackburn, AAkunne, HCorbin, ADavis, MDGeorgic, LWhetzel, SZoski, KHeffner, TPugsley, TWise, L Aminopyrimidines with high affinity for both serotonin and dopamine receptors. J Med Chem41:760-71 (1998) 
 
D(2) dopamine receptor
Name:D(2) dopamine receptor
Type:Cell-surface receptors
Mol. Mass.:50647.10
Organism:Homo sapiens (Human)
Description:P14416
Residue:443
BDBM50063298
NameBDBM50063298
Synonyms:(4-{2-[4-(2,3-Dichloro-phenyl)-piperazin-1-yl]-ethyl}-cyclohexyl)-pyrimidin-2-yl-amine | CHEMBL350352
TypeSmall organic molecule
Emp. Form.C22H29Cl2N5
Mol. Mass.434.405
SMILESClc1cccc(N2CCN(CC[C@H]3CC[C@@H](CC3)Nc3ncccn3)CC2)c1Cl