Reaction Details
TargetComplement C1r subcomponent
LigandBDBM50063715
Substrate/Competitorn/a
Meas. Tech.ChEMBL_40166 (CHEMBL655961)
IC50 3500±n/a nM
Citation Hays, SJCaprathe, BWGilmore, JLAmin, NEmmerling, MRMichael, WNadimpalli, RNath, RRaser, KJStafford, DWatson, DWang, KJaen, JC 2-amino-4H-3,1-benzoxazin-4-ones as inhibitors of C1r serine protease. J Med Chem41:1060-7 (1998) 
 
Complement C1r subcomponent
Name:Complement C1r subcomponent
Type:Enzyme
Mol. Mass.:80113.65
Organism:Homo sapiens (Human)
Description:P00736
Residue:705
BDBM50063715
NameBDBM50063715
Synonyms:2-(2-Iodo-phenylamino)-benzo[d][1,3]oxazin-4-one | CHEMBL276438
TypeSmall organic molecule
Emp. Form.C14H9IN2O2
Mol. Mass.364.1379
SMILESIc1ccccc1Nc1nc2ccccc2c(=O)o1