Reaction Details
TargetComplement C1r subcomponent
LigandBDBM50063720
Substrate/Competitorn/a
Meas. Tech.ChEMBL_40166 (CHEMBL655961)
IC50 1400±n/a nM
Citation Hays, SJCaprathe, BWGilmore, JLAmin, NEmmerling, MRMichael, WNadimpalli, RNath, RRaser, KJStafford, DWatson, DWang, KJaen, JC 2-amino-4H-3,1-benzoxazin-4-ones as inhibitors of C1r serine protease. J Med Chem41:1060-7 (1998) 
 
Complement C1r subcomponent
Name:Complement C1r subcomponent
Type:Enzyme
Mol. Mass.:80113.65
Organism:Homo sapiens (Human)
Description:P00736
Residue:705
BDBM50063720
NameBDBM50063720
Synonyms:2-(2-Chloro-phenylamino)-7-nitro-benzo[d][1,3]oxazin-4-one | CHEMBL10554
TypeSmall organic molecule
Emp. Form.C14H8ClN3O4
Mol. Mass.317.684
SMILES[O-][N+](=O)c1ccc2c(c1)nc(Nc1ccccc1Cl)oc2=O