Reaction Details
TargetComplement C1r subcomponent
LigandBDBM50063708
Substrate/Competitorn/a
Meas. Tech.ChEMBL_40166 (CHEMBL655961)
IC50 1700±n/a nM
Citation Hays, SJCaprathe, BWGilmore, JLAmin, NEmmerling, MRMichael, WNadimpalli, RNath, RRaser, KJStafford, DWatson, DWang, KJaen, JC 2-amino-4H-3,1-benzoxazin-4-ones as inhibitors of C1r serine protease. J Med Chem41:1060-7 (1998) 
 
Complement C1r subcomponent
Name:Complement C1r subcomponent
Type:Enzyme
Mol. Mass.:80113.65
Organism:Homo sapiens (Human)
Description:P00736
Residue:705
BDBM50063708
NameBDBM50063708
Synonyms:7-Fluoro-2-(2-iodo-phenylamino)-benzo[d][1,3]oxazin-4-one | CHEMBL10435
TypeSmall organic molecule
Emp. Form.C14H8FIN2O2
Mol. Mass.382.1284
SMILESFc1ccc2c(c1)nc(Nc1ccccc1I)oc2=O