Reaction Details
TargetOxidized purine nucleoside triphosphate hydrolase
LigandBDBM50511435
Substrate/Competitorn/a
Meas. Tech.ChEMBL_1844828 (CHEMBL4345255)
IC50 16±n/a nM
Citation Farand, JKropf, JEBlomgren, PXu, JSchmitt, ACNewby, ZEWang, TMurakami, EBarauskas, OSudhamsu, JFeng, JYNiedziela-Majka, ASchultz, BESchwartz, KViatchenko-Karpinski, SKornyeyev, DKashishian, AFan, PChen, XLansdon, EBPorts, MOCurrie, KSWatkins, WJNotte, GT Discovery of Potent and Selective MTH1 Inhibitors for Oncology: Enabling Rapid Target (In)Validation. ACS Med Chem Lett11:358-364 (2020) 
 
Oxidized purine nucleoside triphosphate hydrolase
Name:Oxidized purine nucleoside triphosphate hydrolase
Type:Protein
Mol. Mass.:22514.81
Organism:Homo sapiens (Human)
Description:P36639
Residue:156
BDBM50511435
NameBDBM50511435
Synonyms:CHEMBL4574443
TypeSmall organic molecule
Emp. Form.C13H16N4O
Mol. Mass.244.2923
SMILESCNc1cc(Oc2cccc(C)c2C)nc(N)n1