Reaction Details
TargetOxidized purine nucleoside triphosphate hydrolase
LigandBDBM50511438
Substrate/Competitorn/a
Meas. Tech.ChEMBL_1844828 (CHEMBL4345255)
IC50 5.6±n/a nM
Citation Farand, JKropf, JEBlomgren, PXu, JSchmitt, ACNewby, ZEWang, TMurakami, EBarauskas, OSudhamsu, JFeng, JYNiedziela-Majka, ASchultz, BESchwartz, KViatchenko-Karpinski, SKornyeyev, DKashishian, AFan, PChen, XLansdon, EBPorts, MOCurrie, KSWatkins, WJNotte, GT Discovery of Potent and Selective MTH1 Inhibitors for Oncology: Enabling Rapid Target (In)Validation. ACS Med Chem Lett11:358-364 (2020) 
 
Oxidized purine nucleoside triphosphate hydrolase
Name:Oxidized purine nucleoside triphosphate hydrolase
Type:Protein
Mol. Mass.:22514.81
Organism:Homo sapiens (Human)
Description:P36639
Residue:156
BDBM50511438
NameBDBM50511438
Synonyms:CHEMBL4444960
TypeSmall organic molecule
Emp. Form.C13H17N5
Mol. Mass.243.3076
SMILESCNc1cc(N[C@@H](C)c2ccccc2)nc(N)n1