Reaction Details
TargetOxidized purine nucleoside triphosphate hydrolase
LigandBDBM50162076
Substrate/Competitorn/a
Meas. Tech.ChEMBL_1844828 (CHEMBL4345255)
IC50 421±n/a nM
Citation Farand, JKropf, JEBlomgren, PXu, JSchmitt, ACNewby, ZEWang, TMurakami, EBarauskas, OSudhamsu, JFeng, JYNiedziela-Majka, ASchultz, BESchwartz, KViatchenko-Karpinski, SKornyeyev, DKashishian, AFan, PChen, XLansdon, EBPorts, MOCurrie, KSWatkins, WJNotte, GT Discovery of Potent and Selective MTH1 Inhibitors for Oncology: Enabling Rapid Target (In)Validation. ACS Med Chem Lett11:358-364 (2020) 
 
Oxidized purine nucleoside triphosphate hydrolase
Name:Oxidized purine nucleoside triphosphate hydrolase
Type:Protein
Mol. Mass.:22514.81
Organism:Homo sapiens (Human)
Description:P36639
Residue:156
BDBM50162076
NameBDBM50162076
Synonyms:CHEMBL3793901
TypeSmall organic molecule
Emp. Form.C16H20N4O3
Mol. Mass.316.355
SMILESCOc1ccc2nc3[nH]nc(C)c3c(NCCOCCO)c2c1