Reaction Details
TargetOxidized purine nucleoside triphosphate hydrolase
LigandBDBM50255583
Substrate/Competitorn/a
Meas. Tech.ChEMBL_1844827 (CHEMBL4345254)
IC50 2.3±n/a nM
Citation Farand, JKropf, JEBlomgren, PXu, JSchmitt, ACNewby, ZEWang, TMurakami, EBarauskas, OSudhamsu, JFeng, JYNiedziela-Majka, ASchultz, BESchwartz, KViatchenko-Karpinski, SKornyeyev, DKashishian, AFan, PChen, XLansdon, EBPorts, MOCurrie, KSWatkins, WJNotte, GT Discovery of Potent and Selective MTH1 Inhibitors for Oncology: Enabling Rapid Target (In)Validation. ACS Med Chem Lett11:358-364 (2020) 
 
Oxidized purine nucleoside triphosphate hydrolase
Name:Oxidized purine nucleoside triphosphate hydrolase
Type:Protein
Mol. Mass.:22514.81
Organism:Homo sapiens (Human)
Description:P36639
Residue:156
BDBM50255583
NameBDBM50255583
Synonyms:CHEMBL4096813
TypeSmall organic molecule
Emp. Form.C15H20N4O2
Mol. Mass.288.3449
SMILESCCNC(=O)c1cc2c(ccnc2[nH]1)N1CCOC[C@@H]1C