Reaction Details
TargetOxidized purine nucleoside triphosphate hydrolase
LigandBDBM50511464
Substrate/Competitorn/a
Meas. Tech.ChEMBL_1844828 (CHEMBL4345255)
IC50 3.7±n/a nM
Citation Farand, JKropf, JEBlomgren, PXu, JSchmitt, ACNewby, ZEWang, TMurakami, EBarauskas, OSudhamsu, JFeng, JYNiedziela-Majka, ASchultz, BESchwartz, KViatchenko-Karpinski, SKornyeyev, DKashishian, AFan, PChen, XLansdon, EBPorts, MOCurrie, KSWatkins, WJNotte, GT Discovery of Potent and Selective MTH1 Inhibitors for Oncology: Enabling Rapid Target (In)Validation. ACS Med Chem Lett11:358-364 (2020) 
 
Oxidized purine nucleoside triphosphate hydrolase
Name:Oxidized purine nucleoside triphosphate hydrolase
Type:Protein
Mol. Mass.:22514.81
Organism:Homo sapiens (Human)
Description:P36639
Residue:156
BDBM50511464
NameBDBM50511464
Synonyms:CHEMBL4437933
TypeSmall organic molecule
Emp. Form.C9H15N5
Mol. Mass.193.2489
SMILESCNc1cc(nc(N)n1)N1CCCC1