Reaction Details
TargetBromodomain-containing protein 4
LigandBDBM50511849
Substrate/Competitorn/a
Meas. Tech.ChEMBL_1845907 (CHEMBL4346334)
Ki 0.500000±n/a nM
Citation Sheppard, GSWang, LFidanze, SDHasvold, LALiu, DPratt, JKPark, CHLongenecker, KQiu, WTorrent, MKovar, PJBui, MFaivre, EHuang, XLin, XWilcox, DZhang, LShen, YAlbert, DHMagoc, TJRajaraman, GKati, WMMcDaniel, KF Discovery of  J Med Chem63:5585-5623 (2020) 
 
Bromodomain-containing protein 4
Name:Bromodomain-containing protein 4
Type:Protein
Mol. Mass.:152264.84
Organism:Homo sapiens (Human)
Description:O60885
Residue:1362
BDBM50511849
NameBDBM50511849
Synonyms:CHEMBL4465299
TypeSmall organic molecule
Emp. Form.C28H30N4O4S
Mol. Mass.518.627
SMILESCCNC(=O)c1cc2c(cn(C)c(=O)c2[nH]1)-c1cc(ccc1N1CCc2cccc(C)c12)S(=O)(=O)CC