Reaction Details
TargetBromodomain-containing protein 4
LigandBDBM439461
Substrate/Competitorn/a
Meas. Tech.ChEMBL_1845907 (CHEMBL4346334)
Ki 0.600000±n/a nM
Citation Sheppard, GSWang, LFidanze, SDHasvold, LALiu, DPratt, JKPark, CHLongenecker, KQiu, WTorrent, MKovar, PJBui, MFaivre, EHuang, XLin, XWilcox, DZhang, LShen, YAlbert, DHMagoc, TJRajaraman, GKati, WMMcDaniel, KF Discovery of  J Med Chem63:5585-5623 (2020) 
 
Bromodomain-containing protein 4
Name:Bromodomain-containing protein 4
Type:Protein
Mol. Mass.:152264.84
Organism:Homo sapiens (Human)
Description:O60885
Residue:1362
BDBM439461
NameBDBM439461
Synonyms:US10633379, Example 3 | US10633379, Example 68
TypeSmall organic molecule
Emp. Form.C28H31N3O4
Mol. Mass.473.5634
SMILESCCNC(=O)c1cc2c(cn(C)c(=O)c2[nH]1)-c1cc(ccc1Oc1c(C)cccc1C)C(C)(C)O