Reaction Details
TargetBromodomain-containing protein 4
LigandBDBM50511850
Substrate/Competitorn/a
Meas. Tech.ChEMBL_1845907 (CHEMBL4346334)
Ki 0.500000±n/a nM
Citation Sheppard, GSWang, LFidanze, SDHasvold, LALiu, DPratt, JKPark, CHLongenecker, KQiu, WTorrent, MKovar, PJBui, MFaivre, EHuang, XLin, XWilcox, DZhang, LShen, YAlbert, DHMagoc, TJRajaraman, GKati, WMMcDaniel, KF Discovery of  J Med Chem63:5585-5623 (2020) 
 
Bromodomain-containing protein 4
Name:Bromodomain-containing protein 4
Type:Protein
Mol. Mass.:152264.84
Organism:Homo sapiens (Human)
Description:O60885
Residue:1362
BDBM50511850
NameBDBM50511850
Synonyms:CHEMBL4435166
TypeSmall organic molecule
Emp. Form.C27H28N4O4
Mol. Mass.472.5356
SMILESCCNC(=O)c1cc2c(cn(C)c(=O)c2[nH]1)-c1cc(NC(C)=O)ccc1Oc1c(C)cccc1C