Reaction Details
TargetDelta-type opioid receptor
LigandBDBM50069563
Substrate/Competitorn/a
Meas. Tech.ChEBML_147163
Ki 7.4±n/a nM
Citation Li, GHaq, WXiang, LLou, BSHughes, RDe Leon, IADavis, PGillespie, TJRomanowski, MZhu, XMisicka, ALipkowski, AWPorreca, FDavis, TPYamamura, HIO'Brien, DFHruby, VJ Modifications of the 4,4'-residues and SAR studies of Biphalin, a highly potent opioid receptor active peptide. Bioorg Med Chem Lett8:555-60 (1999) Delta-type opioid receptor
Name:Delta-type opioid receptor
Type:G Protein-Coupled Receptor (GPCR)
Mol. Mass.:40382.98
Organism:Homo sapiens (Human)
Description:Competition binding assays were carried out using membrane preparations from transfected HN9.10 cells that constitutively expressed the delta opioid receptor.
Residue:372
BDBM50069563
NameBDBM50069563
Synonyms:Biphalin Analogue | CHEMBL2371079
TypeSmall organic molecule
Emp. Form.C54H60N10O10
Mol. Mass.1009.1152
SMILESC[C@@H](NC(=O)[C@@H](N)Cc1ccc(O)cc1)C(=O)NCC(=O)N[C@@H](Cc1ccc2ccccc2c1)C(=O)NNC(=O)[C@H](Cc1ccc2ccccc2c1)NC(=O)CNC(=O)[C@@H](C)NC(=O)[C@@H](N)Cc1ccc(O)cc1