Reaction Details
TargetDelta-type opioid receptor
LigandBDBM50069561
Substrate/Competitorn/a
Meas. Tech.ChEBML_147163
Ki 11±n/a nM
Citation Li, GHaq, WXiang, LLou, BSHughes, RDe Leon, IADavis, PGillespie, TJRomanowski, MZhu, XMisicka, ALipkowski, AWPorreca, FDavis, TPYamamura, HIO'Brien, DFHruby, VJ Modifications of the 4,4'-residues and SAR studies of Biphalin, a highly potent opioid receptor active peptide. Bioorg Med Chem Lett8:555-60 (1999) Delta-type opioid receptor
Name:Delta-type opioid receptor
Type:G Protein-Coupled Receptor (GPCR)
Mol. Mass.:40382.98
Organism:Homo sapiens (Human)
Description:Competition binding assays were carried out using membrane preparations from transfected HN9.10 cells that constitutively expressed the delta opioid receptor.
Residue:372
BDBM50069561
NameBDBM50069561
Synonyms:2-Amino-N-((S)-1-{[((S)-1-{N'-[(S)-2-(2-{(S)-2-[2-amino-3-(4-hydroxy-phenyl)-propionylamino]-propionylamino}-acetylamino)-3-phenyl-butyryl]-hydrazinocarbonyl}-2-phenyl-propylcarbamoyl)-methyl]-carbamoyl}-ethyl)-3-(4-hydroxy-phenyl)-propionamide | CHEMBL2371081
TypeSmall organic molecule
Emp. Form.C48H60N10O10
Mol. Mass.937.051
SMILESC[C@@H](NC(=O)[C@@H](N)Cc1ccc(O)cc1)C(=O)NCC(=O)N[C@@H]([C@@H](C)c1ccccc1)C(=O)NNC(=O)[C@@H](NC(=O)CNC(=O)[C@@H](C)NC(=O)[C@@H](N)Cc1ccc(O)cc1)[C@@H](C)c1ccccc1