Reaction Details
TargetMu-type opioid receptor
LigandBDBM50069563
Substrate/Competitorn/a
Meas. Tech.ChEBML_138747
IC50 2.2±n/a nM
Citation Li, GHaq, WXiang, LLou, BSHughes, RDe Leon, IADavis, PGillespie, TJRomanowski, MZhu, XMisicka, ALipkowski, AWPorreca, FDavis, TPYamamura, HIO'Brien, DFHruby, VJ Modifications of the 4,4'-residues and SAR studies of Biphalin, a highly potent opioid receptor active peptide. Bioorg Med Chem Lett8:555-60 (1999) Mu-type opioid receptor
Name:Mu-type opioid receptor
Type:Enzyme Catalytic Domain
Mol. Mass.:11165.58
Organism:GUINEA PIG
Description:P97266
Residue:98
BDBM50069563
NameBDBM50069563
Synonyms:Biphalin Analogue | CHEMBL2371079
TypeSmall organic molecule
Emp. Form.C54H60N10O10
Mol. Mass.1009.1152
SMILESC[C@@H](NC(=O)[C@@H](N)Cc1ccc(O)cc1)C(=O)NCC(=O)N[C@@H](Cc1ccc2ccccc2c1)C(=O)NNC(=O)[C@H](Cc1ccc2ccccc2c1)NC(=O)CNC(=O)[C@@H](C)NC(=O)[C@@H](N)Cc1ccc(O)cc1