Reaction Details
TargetDelta-type opioid receptor
LigandBDBM50069558
Substrate/Competitorn/a
Meas. Tech.ChEBML_136097
IC50 27±n/a nM
Citation Li, GHaq, WXiang, LLou, BSHughes, RDe Leon, IADavis, PGillespie, TJRomanowski, MZhu, XMisicka, ALipkowski, AWPorreca, FDavis, TPYamamura, HIO'Brien, DFHruby, VJ Modifications of the 4,4'-residues and SAR studies of Biphalin, a highly potent opioid receptor active peptide. Bioorg Med Chem Lett8:555-60 (1999) Delta-type opioid receptor
Name:Delta-type opioid receptor
Type:Enzyme Catalytic Domain
Mol. Mass.:40577.25
Organism:MOUSE
Description:P32300
Residue:372
BDBM50069558
NameBDBM50069558
Synonyms:2-Amino-N-((S)-1-{[(2-{N'-[2-(2-{(S)-2-[2-amino-3-(4-hydroxy-phenyl)-propionylamino]-propionylamino}-acetylamino)-3-phenyl-propionyl]-hydrazino}-1-benzyl-2-oxo-ethylcarbamoyl)-methyl]-carbamoyl}-ethyl)-3-(4-hydroxy-phenyl)-propionamide | CHEMBL2371056
TypeSmall organic molecule
Emp. Form.C46H56N10O10
Mol. Mass.908.9978
SMILESC[C@@H](NC(=O)[C@@H](N)Cc1ccc(O)cc1)C(=O)NCC(=O)N[C@@H](Cc1ccccc1)C(=O)NNC(=O)[C@H](Cc1ccccc1)NC(=O)CNC(=O)[C@H](C)NC(=O)[C@@H](N)Cc1ccc(O)cc1