Reaction Details
TargetDelta-type opioid receptor
LigandBDBM50069559
Substrate/Competitorn/a
Meas. Tech.ChEBML_136097
IC50 17±n/a nM
Citation Li, GHaq, WXiang, LLou, BSHughes, RDe Leon, IADavis, PGillespie, TJRomanowski, MZhu, XMisicka, ALipkowski, AWPorreca, FDavis, TPYamamura, HIO'Brien, DFHruby, VJ Modifications of the 4,4'-residues and SAR studies of Biphalin, a highly potent opioid receptor active peptide. Bioorg Med Chem Lett8:555-60 (1999) Delta-type opioid receptor
Name:Delta-type opioid receptor
Type:Enzyme Catalytic Domain
Mol. Mass.:40577.25
Organism:MOUSE
Description:P32300
Residue:372
BDBM50069559
NameBDBM50069559
Synonyms:Biphalin Analogue | CHEMBL2371057
TypeSmall organic molecule
Emp. Form.C54H60N10O10
Mol. Mass.1009.1152
SMILESC[C@@H](NC(=O)[C@@H](N)Cc1ccc(O)cc1)C(=O)NCC(=O)N[C@@H](Cc1cccc2ccccc12)C(=O)NNC(=O)[C@H](Cc1cccc2ccccc12)NC(=O)CNC(=O)[C@@H](C)NC(=O)[C@@H](N)Cc1ccc(O)cc1