Reaction Details
TargetTyrosine-protein kinase BTK
LigandBDBM259415
Substrate/Competitorn/a
Meas. Tech.ChEMBL_1857760 (CHEMBL4358489)
IC50 28±n/a nM
Citation Angst, DGessier, FJanser, PVulpetti, AWälchli, RBeerli, CLittlewood-Evans, ADawson, JNuesslein-Hildesheim, BWieczorek, GGutmann, SScheufler, CHinniger, AZimmerlin, AFunhoff, EGPulz, RCenni, B Discovery of LOU064 (Remibrutinib), a Potent and Highly Selective Covalent Inhibitor of Bruton's Tyrosine Kinase. J Med Chem63:5102-5118 (2020) 
 
Tyrosine-protein kinase BTK
Name:Tyrosine-protein kinase BTK
Type:Enzyme
Mol. Mass.:76289.95
Organism:Homo sapiens (Human)
Description:Q06187
Residue:659
BDBM259415
NameBDBM259415
Synonyms:US10457647, Example 14 US11673868, Example 14 | US9512084, 14
TypeSmall organic molecule
Emp. Form.C28H29F2N5O3
Mol. Mass.521.5584
SMILESCCN(CCOc1c(N)ncnc1-c1cc(F)cc(NC(=O)c2ccc(cc2F)C2CC2)c1C)C(=O)C=C