Reaction Details
TargetLipoprotein lipase
LigandBDBM50521226
Substrate/Competitorn/a
Meas. Tech.ChEMBL_1883778 (CHEMBL4385277)
IC50 12000±n/a nM
Citation Johnson, JATora, GPi, ZPhillips, MYin, XYang, RZhao, LChen, AYTaylor, DSBasso, MRose, ABehnia, KOnorato, JChen, XQAbell, LMLu, HLocke, GCaporuscio, CGalella, MAdam, LPGordon, DWexler, RRFinlay, HJ Sulfonylated Benzothiazoles as Inhibitors of Endothelial Lipase. ACS Med Chem Lett9:1263-1268 (2018) 
 
Lipoprotein lipase
Name:Lipoprotein lipase
Type:PROTEIN
Mol. Mass.:53173.96
Organism:Homo sapiens (Human)
Description:ChEMBL_1280894
Residue:475
BDBM50521226
NameBDBM50521226
Synonyms:CHEMBL4471545
TypeSmall organic molecule
Emp. Form.C18H17N5O5S3
Mol. Mass.479.553
SMILESCS(=O)(=O)C(c1nnc(CNS(N)(=O)=O)o1)c1nc2ccc(cc2s1)-c1ccccc1