Reaction Details
TargetProthrombin
LigandBDBM50078550
Substrate/Competitorn/a
Meas. Tech.ChEBML_208128
IC50 43000±n/a nM
Citation Pass, MAbu-Rabie, SBaxter, AConroy, RCoote, SJCraven, APFinch, HHindley, SKelly, HALowdon, AWMcDonald, EMitchell, WLPegg, NAProcopiou, PARamsden, NGThomas, RWalker, DAWatson, NSJhoti, HMooney, CJTang, CMThomas, PJParry, SPatel, C Thrombin inhibitors based on [5,5] trans-fused indane lactams. Bioorg Med Chem Lett9:1657-62 (1999) Prothrombin
Name:Prothrombin
Type:Protein
Mol. Mass.:70029.57
Organism:Homo sapiens (Human)
Description:P00734
Residue:622
BDBM50078550
NameBDBM50078550
Synonyms:CHEMBL295211 | [(3R,3aS,8aS)-3-(4-Carbamimidoyl-butyl)-2-oxo-3,3a,8,8a-tetrahydro-2H-indeno[2,1-b]pyrrol-1-yl]-acetic acid methyl ester
TypeSmall organic molecule
Emp. Form.C19H25N3O3
Mol. Mass.343.4201
SMILESCOC(=O)CN1[C@H]2Cc3ccccc3[C@@H]2[C@@H](CCCCC(N)=N)C1=O