Reaction Details
TargetCoagulation factor X
LigandBDBM50078544
Substrate/Competitorn/a
Meas. Tech.ChEBML_48643
IC50 74.0±n/a nM
Citation Pass, MAbu-Rabie, SBaxter, AConroy, RCoote, SJCraven, APFinch, HHindley, SKelly, HALowdon, AWMcDonald, EMitchell, WLPegg, NAProcopiou, PARamsden, NGThomas, RWalker, DAWatson, NSJhoti, HMooney, CJTang, CMThomas, PJParry, SPatel, C Thrombin inhibitors based on [5,5] trans-fused indane lactams. Bioorg Med Chem Lett9:1657-62 (1999) Coagulation factor X
Name:Coagulation factor X
Type:Enzyme
Mol. Mass.:54726.60
Organism:Homo sapiens (Human)
Description:n/a
Residue:488
BDBM50078544
NameBDBM50078544
Synonyms:3-[(3R,3aS,8aS)-1-Benzenesulfonyl-3-(4-carbamimidoyl-butyl)-2-oxo-1,2,3,3a,8,8a-hexahydro-indeno[2,1-b]pyrrol-5-yl]-N,N-diethyl-benzamide | CHEMBL297169
TypeSmall organic molecule
Emp. Form.C33H38N4O4S
Mol. Mass.586.744
SMILESCCN(CC)C(=O)c1cccc(c1)-c1ccc2C[C@H]3[C@@H]([C@@H](CCCCC(N)=N)C(=O)N3S(=O)(=O)c3ccccc3)c2c1