Reaction Details
TargetSerine protease 1
LigandBDBM50078552
Substrate/Competitorn/a
Meas. Tech.ChEBML_212712
IC50 2300±n/a nM
Citation Pass, MAbu-Rabie, SBaxter, AConroy, RCoote, SJCraven, APFinch, HHindley, SKelly, HALowdon, AWMcDonald, EMitchell, WLPegg, NAProcopiou, PARamsden, NGThomas, RWalker, DAWatson, NSJhoti, HMooney, CJTang, CMThomas, PJParry, SPatel, C Thrombin inhibitors based on [5,5] trans-fused indane lactams. Bioorg Med Chem Lett9:1657-62 (1999) Serine protease 1
Name:Serine protease 1
Type:Enzyme
Mol. Mass.:26557.80
Organism:Homo sapiens (Human)
Description:P07477
Residue:247
BDBM50078552
NameBDBM50078552
Synonyms:(3R,3aS,8aS)-3-(4-Carbamimidoyl-butyl)-5-(3-diethylcarbamoyl-phenyl)-2-oxo-3,3a,8,8a-tetrahydro-2H-indeno[2,1-b]pyrrole-1-carboxylic acid 3-phenyl-propyl ester | CHEMBL47102
TypeSmall organic molecule
Emp. Form.C37H44N4O4
Mol. Mass.608.7697
SMILESCCN(CC)C(=O)c1cccc(c1)-c1ccc2C[C@H]3[C@@H]([C@@H](CCCCC(N)=N)C(=O)N3C(=O)OCCCc3ccccc3)c2c1