Reaction Details
TargetReceptor-type tyrosine-protein phosphatase beta
LigandBDBM50079856
Substrate/Competitorn/a
Meas. Tech.ChEMBL_162607 (CHEMBL771319)
IC50 600±n/a nM
Citation Wrobel, JSredy, JMoxham, CDietrich, ALi, ZSawicki, DRSeestaller, LWu, LKatz, ASullivan, DTio, CZhang, ZY PTP1B inhibition and antihyperglycemic activity in the ob/ob mouse model of novel 11-arylbenzo[b]naphtho[2,3-d]furans and 11-arylbenzo[b]naphtho[2,3-d]thiophenes. J Med Chem42:3199-202 (1999) 
 
Receptor-type tyrosine-protein phosphatase beta
Name:Receptor-type tyrosine-protein phosphatase beta
Type:Protein
Mol. Mass.:224324.80
Organism:Homo sapiens (Human)
Description:P23467
Residue:1997
BDBM50079856
NameBDBM50079856
Synonyms:CHEMBL108721 | [2,6-Dibromo-4-(6-bromo-benzo[b]naphtho[2,3-d]thiophen-11-yl)-phenoxy]-acetic acid
TypeSmall organic molecule
Emp. Form.C24H13Br3O3S
Mol. Mass.621.135
SMILESOC(=O)COc1c(Br)cc(cc1Br)-c1c2c(sc3ccccc23)c(Br)c2ccccc12