Reaction Details
TargetCoagulation factor X
LigandBDBM50087641
Substrate/Competitorn/a
Meas. Tech.ChEMBL_48803 (CHEMBL662828)
Ki 16±n/a nM
Citation Tamura, SYLevy, OEUong, THReiner, JEGoldman, EAHo, JZCohen, CRBergum, PWNutt, RFBrunck, TKSemple, JE Guanylpiperidine peptidomimetics: potent and selective bis-cation inhibitors of factor Xa. Bioorg Med Chem Lett10:745-9 (2000) Coagulation factor X
Name:Coagulation factor X
Type:Enzyme
Mol. Mass.:54726.60
Organism:Homo sapiens (Human)
Description:n/a
Residue:488
BDBM50087641
NameBDBM50087641
Synonyms:3-{[(R)-1-{[((S)-1-Carbamimidoyl-2-hydroxy-piperidin-3-ylcarbamoyl)-methyl]-carbamoyl}-2-(1-carbamimidoyl-piperidin-4-yl)-ethylsulfamoyl]-methyl}-benzoic acid; TFA | CHEMBL163482
TypeSmall organic molecule
Emp. Form.C25H39N9O7S
Mol. Mass.609.698
SMILESNC(=N)N1CCC(C[C@@H](NS(=O)(=O)Cc2cccc(c2)C(O)=O)C(=O)NCC(=O)N[C@H]2CCCN(C2O)C(N)=N)CC1