Reaction Details
TargetCoagulation factor X
LigandBDBM50087636
Substrate/Competitorn/a
Meas. Tech.ChEBML_48807
IC50 0.920±n/a nM
Citation Tamura, SYLevy, OEUong, THReiner, JEGoldman, EAHo, JZCohen, CRBergum, PWNutt, RFBrunck, TKSemple, JE Guanylpiperidine peptidomimetics: potent and selective bis-cation inhibitors of factor Xa. Bioorg Med Chem Lett10:745-9 (2000) Coagulation factor X
Name:Coagulation factor X
Type:Enzyme
Mol. Mass.:54726.60
Organism:Homo sapiens (Human)
Description:n/a
Residue:488
BDBM50087636
NameBDBM50087636
Synonyms:(R)-N-[((S)-1-Carbamimidoyl-2-hydroxy-piperidin-3-ylcarbamoyl)-methyl]-3-(1-carbamimidoyl-piperidin-3-yl)-2-phenylmethanesulfonylamino-propionamide; TFA | CHEMBL162443
TypeSmall organic molecule
Emp. Form.C24H39N9O5S
Mol. Mass.565.689
SMILESNC(=N)N1CCCC(C[C@@H](NS(=O)(=O)Cc2ccccc2)C(=O)NCC(=O)N[C@H]2CCCN(C2O)C(N)=N)C1