Reaction Details
TargetPlasminogen
LigandBDBM50087639
Substrate/Competitorn/a
Meas. Tech.ChEBML_155069
IC50 872.0±n/a nM
Citation Tamura, SYLevy, OEUong, THReiner, JEGoldman, EAHo, JZCohen, CRBergum, PWNutt, RFBrunck, TKSemple, JE Guanylpiperidine peptidomimetics: potent and selective bis-cation inhibitors of factor Xa. Bioorg Med Chem Lett10:745-9 (2000) Plasminogen
Name:Plasminogen
Type:Enzyme
Mol. Mass.:90579.18
Organism:Homo sapiens (Human)
Description:n/a
Residue:810
BDBM50087639
NameBDBM50087639
Synonyms:(R)-N-[((S)-1-Carbamimidoyl-2-hydroxy-piperidin-3-ylcarbamoyl)-methyl]-3-(1-carbamimidoyl-piperidin-4-yl)-2-(2-tetrazol-1-yl-phenylmethanesulfonylamino)-propionamide; TFA | CHEMBL164419
TypeSmall organic molecule
Emp. Form.C25H39N13O5S
Mol. Mass.633.726
SMILESNC(=N)N1CCC(C[C@@H](NS(=O)(=O)Cc2ccccc2-n2cnnn2)C(=O)NCC(=O)N[C@H]2CCCN(C2O)C(N)=N)CC1