Reaction Details
TargetCoagulation factor X
LigandBDBM50087643
Substrate/Competitorn/a
Meas. Tech.ChEBML_48807
IC50 0.940000±n/a nM
Citation Tamura, SYLevy, OEUong, THReiner, JEGoldman, EAHo, JZCohen, CRBergum, PWNutt, RFBrunck, TKSemple, JE Guanylpiperidine peptidomimetics: potent and selective bis-cation inhibitors of factor Xa. Bioorg Med Chem Lett10:745-9 (2000) Coagulation factor X
Name:Coagulation factor X
Type:Enzyme
Mol. Mass.:54726.60
Organism:Homo sapiens (Human)
Description:n/a
Residue:488
BDBM50087643
NameBDBM50087643
Synonyms:2-{[(R)-1-{[((S)-1-Carbamimidoyl-2-hydroxy-piperidin-3-ylcarbamoyl)-methyl]-carbamoyl}-2-(1-carbamimidoyl-piperidin-4-yl)-ethylsulfamoyl]-methyl}-benzoic acid methyl ester; TFA | CHEMBL351978
TypeSmall organic molecule
Emp. Form.C26H41N9O7S
Mol. Mass.623.725
SMILESCOC(=O)c1ccccc1CS(=O)(=O)N[C@H](CC1CCN(CC1)C(N)=N)C(=O)NCC(=O)N[C@H]1CCCN(C1O)C(N)=N