Reaction Details
TargetEphrin type-A receptor 8
LigandBDBM50528539
Substrate/Competitorn/a
Meas. Tech.ChEMBL_1922874 (CHEMBL4425830)
Kd 550±n/a nM
Citation Wang, ZBian, HBartual, SGDu, WLuo, JZhao, HZhang, SMo, CZhou, YXu, YTu, ZRen, XLu, XBrekken, RAYao, LBullock, ANSu, JDing, K Structure-Based Design of Tetrahydroisoquinoline-7-carboxamides as Selective Discoidin Domain Receptor 1 (DDR1) Inhibitors. J Med Chem59:5911-6 (2016) 
 
Ephrin type-A receptor 8
Name:Ephrin type-A receptor 8
Type:PROTEIN
Mol. Mass.:111022.09
Organism:Homo sapiens (Human)
Description:ChEMBL_774600
Residue:1005
BDBM50528539
NameBDBM50528539
Synonyms:CHEMBL4553037
TypeSmall organic molecule
Emp. Form.C26H23F3N6O
Mol. Mass.492.4956
SMILESC[C@H]1CN(Cc2cc(ccc12)C(=O)Nc1cc(cc(c1)C(F)(F)F)-n1cnc(C)c1)c1cncnc1