Reaction Details
TargetReduced folate transporter
LigandBDBM50534429
Substrate/Competitorn/a
Meas. Tech.ChEMBL_1928965 (CHEMBL4432141)
IC50 808±n/a nM
Citation Golani, LKWallace-Povirk, ADeis, SMWong, JKe, JGu, XRaghavan, SWilson, MRLi, XPolin, Lde Waal, PWWhite, KKushner, JO'Connor, CHou, ZXu, HEMelcher, KDann, CEMatherly, LHGangjee, A Tumor Targeting with Novel 6-Substituted Pyrrolo [2,3-d] Pyrimidine Antifolates with Heteroatom Bridge Substitutions via Cellular Uptake by Folate Receptor ? and the Proton-Coupled Folate Transporter and Inhibition of de Novo Purine Nucleotide Biosynthesis. J Med Chem59:7856-76 (2016) 
 
Reduced folate transporter
Name:Reduced folate transporter
Type:PROTEIN
Mol. Mass.:64885.16
Organism:Homo sapiens (Human)
Description:ChEMBL_1469594
Residue:591
BDBM50534429
NameBDBM50534429
Synonyms:CHEMBL4444011
TypeSmall organic molecule
Emp. Form.C22H24N6O7
Mol. Mass.484.462
SMILESCC(=O)N(CCc1cc2c(nc(N)[nH]c2=O)[nH]1)c1ccc(cc1)C(=O)N[C@@H](CCC(O)=O)C(O)=O