Reaction Details
TargetSerine/threonine-protein kinase MARK1
LigandBDBM50537742
Substrate/Competitorn/a
Meas. Tech.ChEBML_1970721
IC50>100000±n/a nM
Citation Zhou, HMcGowan, MALipford, KChristopher, MFradera, XWitter, DLesburg, CALi, CMethot, JLLampe, JAchab, AShaffer, LGoldenblatt, PShah, SBass, ASchroeder, GChen, DZeng, HAugustin, MAKatz, JD Discovery and optimization of heteroaryl piperazines as potent and selective PI3K? inhibitors. Bioorg Med Chem Lett30:0 (2020) 
 
Serine/threonine-protein kinase MARK1
Name:Serine/threonine-protein kinase MARK1
Type:Enzyme
Mol. Mass.:89034.85
Organism:Homo sapiens (Human)
Description:Q9P0L2
Residue:795
BDBM50537742
NameBDBM50537742
Synonyms:CHEMBL4634634 | US11179389, Compound 1-14
TypeSmall organic molecule
Emp. Form.C19H23N7O
Mol. Mass.365.4322
SMILESC[C@@H]1C[C@H]1C(=O)N1CCN(C[C@H]1C)c1cnc(C#N)c(n1)-c1cnn(C)c1