Reaction Details
TargetC-C chemokine receptor type 5
LigandBDBM50096519
Substrate/Competitorn/a
Meas. Tech.ChEMBL_85970 (CHEMBL693290)
IC50 4±n/a nM
Citation Dorn, CPFinke, PEOates, BBudhu, RJMills, SGMacCoss, MMalkowitz, LSpringer, MSDaugherty, BLGould, SLDeMartino, JASiciliano, SJCarella, ACarver, GHolmes, KDanzeisen, RHazuda, DKessler, JLineberger, JMiller, MSchleif, WAEmini, EA Antagonists of the human CCR5 receptor as anti-HIV-1 agents. part 1: discovery and initial structure-activity relationships for 1 -amino-2-phenyl-4-(piperidin-1-yl)butanes. Bioorg Med Chem Lett11:259-64 (2001) C-C chemokine receptor type 5
Name:C-C chemokine receptor type 5
Type:Enzyme
Mol. Mass.:40540.21
Organism:Homo sapiens (Human)
Description:P51681
Residue:352
BDBM50096519
NameBDBM50096519
Synonyms:Benzoic acid (S)-2-(3,4-dichloro-phenyl)-4-(spiro[1-benzothiophene-3,4'-piperidinyl])butyl ester | CHEMBL88319
TypeSmall organic molecule
Emp. Form.C29H29Cl2NO3S
Mol. Mass.542.516
SMILESClc1ccc(cc1Cl)[C@H](CCN1CCC2(CS(=O)c3ccccc23)CC1)COC(=O)c1ccccc1