Reaction Details
TargetC-C chemokine receptor type 5
LigandBDBM50096528
Substrate/Competitorn/a
Meas. Tech.ChEBML_85970
IC50 100±n/a nM
Citation Dorn, CPFinke, PEOates, BBudhu, RJMills, SGMacCoss, MMalkowitz, LSpringer, MSDaugherty, BLGould, SLDeMartino, JASiciliano, SJCarella, ACarver, GHolmes, KDanzeisen, RHazuda, DKessler, JLineberger, JMiller, MSchleif, WAEmini, EA Antagonists of the human CCR5 receptor as anti-HIV-1 agents. part 1: discovery and initial structure-activity relationships for 1 -amino-2-phenyl-4-(piperidin-1-yl)butanes. Bioorg Med Chem Lett11:259-64 (2001) C-C chemokine receptor type 5
Name:C-C chemokine receptor type 5
Type:Enzyme
Mol. Mass.:40540.21
Organism:Homo sapiens (Human)
Description:P51681
Residue:352
BDBM50096528
NameBDBM50096528
Synonyms:1'-[4-cyclohexyl(methyl)sulfonamido-3-(3,4-dichlorophenyl)-(3S)-butyl]spiro[2,3-dihydrobenzo[b]thiophene-1-oxide-3,4'-(hexahydropyridine)] | CHEMBL88644
TypeSmall organic molecule
Emp. Form.C29H38Cl2N2O3S2
Mol. Mass.597.66
SMILESCN(C[C@@H](CCN1CCC2(CS(=O)c3ccccc23)CC1)c1ccc(Cl)c(Cl)c1)S(=O)(=O)C1CCCCC1