Reaction Details
TargetC-C chemokine receptor type 5
LigandBDBM50096531
Substrate/Competitorn/a
Meas. Tech.ChEBML_85970
IC50 780±n/a nM
Citation Dorn, CPFinke, PEOates, BBudhu, RJMills, SGMacCoss, MMalkowitz, LSpringer, MSDaugherty, BLGould, SLDeMartino, JASiciliano, SJCarella, ACarver, GHolmes, KDanzeisen, RHazuda, DKessler, JLineberger, JMiller, MSchleif, WAEmini, EA Antagonists of the human CCR5 receptor as anti-HIV-1 agents. part 1: discovery and initial structure-activity relationships for 1 -amino-2-phenyl-4-(piperidin-1-yl)butanes. Bioorg Med Chem Lett11:259-64 (2001) C-C chemokine receptor type 5
Name:C-C chemokine receptor type 5
Type:Enzyme
Mol. Mass.:40540.21
Organism:Homo sapiens (Human)
Description:P51681
Residue:352
BDBM50096531
NameBDBM50096531
Synonyms:1N-[2-(3,4-dichlorophenyl)-4-spiro[2,3-dihydrobenzo[b]thiophene-3,4'-(hexahydropyridine)]-1-yl-(2S)-butyl]-1-oxide-1N-methyl-phenylcarbamate | CHEMBL314124
TypeSmall organic molecule
Emp. Form.C30H32Cl2N2O3S
Mol. Mass.571.558
SMILESCN(C[C@@H](CCN1CCC2(CS(=O)c3ccccc23)CC1)c1ccc(Cl)c(Cl)c1)C(=O)Oc1ccccc1