Reaction Details
TargetCathepsin S
LigandBDBM19769
Substrate/Competitorn/a
Meas. Tech.ChEMBL_216712 (CHEMBL818677)
Ki 4±n/a nM
Citation Marquis, RWRu, YLoCastro, SMZeng, JYamashita, DSOh, HJErhard, KFDavis, LDTomaszek, TATew, DSalyers, KProksch, JWard, KSmith, BLevy, MCummings, MDHaltiwanger, RCTrescher, GWang, BHemling, MEQuinn, CJCheng, HYLin, FSmith, WWJanson, CAZhao, BMcQueney, MSD'Alessio, KLee, CPMarzulli, ADodds, RABlake, SHwang, SMJames, IEGress, CJBradley, BRLark, MWGowen, MVeber, DF Azepanone-based inhibitors of human and rat cathepsin K. J Med Chem44:1380-95 (2001) Cathepsin S
Name:Cathepsin S
Type:Protein
Mol. Mass.:37507.38
Organism:Homo sapiens (Human)
Description:P25774
Residue:331
BDBM19769
NameBDBM19769
Synonyms:(2S)-2-(1-benzofuran-2-ylformamido)-4-methyl-N-[(4S)-3-oxo-1-(pyridine-2-sulfonyl)azepan-4-yl]pentanamide CHEMBL286364
TypeSmall organic molecule
Emp. Form.C26H30N4O6S
Mol. Mass.526.605
SMILESCC(C)C[C@H](NC(=O)c1cc2ccccc2o1)C(=O)N[C@H]1CCCN(CC1=O)S(=O)(=O)c1ccccn1