Reaction Details
TargetCathepsin K
LigandBDBM50098581
Substrate/Competitorn/a
Meas. Tech.ChEMBL_216705 (CHEMBL820317)
Ki 4.7±n/a nM
Citation Marquis, RWRu, YLoCastro, SMZeng, JYamashita, DSOh, HJErhard, KFDavis, LDTomaszek, TATew, DSalyers, KProksch, JWard, KSmith, BLevy, MCummings, MDHaltiwanger, RCTrescher, GWang, BHemling, MEQuinn, CJCheng, HYLin, FSmith, WWJanson, CAZhao, BMcQueney, MSD'Alessio, KLee, CPMarzulli, ADodds, RABlake, SHwang, SMJames, IEGress, CJBradley, BRLark, MWGowen, MVeber, DF Azepanone-based inhibitors of human and rat cathepsin K. J Med Chem44:1380-95 (2001) Cathepsin K
Name:Cathepsin K
Type:Enzyme
Mol. Mass.:36975.68
Organism:Homo sapiens (Human)
Description:P43235
Residue:329
BDBM50098581
NameBDBM50098581
Synonyms:5-(2-Morpholin-4-yl-ethoxy)-benzofuran-2-carboxylic acid (3-methyl-1-{3-oxo-1-[2-(3-pyridin-2-yl-phenyl)-acetyl]-azepan-4-ylcarbamoyl}-butyl)-amide | CHEMBL31218
TypeSmall organic molecule
Emp. Form.C40H47N5O7
Mol. Mass.709.8305
SMILESCC(C)C[C@H](NC(=O)c1cc2cc(OCCN3CCOCC3)ccc2o1)C(=O)N[C@@H]1CCCN(CC1=O)C(=O)Cc1cccc(c1)-c1ccccn1