Reaction Details
TargetCathepsin K
LigandBDBM50098583
Substrate/Competitorn/a
Meas. Tech.ChEMBL_216705 (CHEMBL820317)
Ki>1000±n/a nM
Citation Marquis, RWRu, YLoCastro, SMZeng, JYamashita, DSOh, HJErhard, KFDavis, LDTomaszek, TATew, DSalyers, KProksch, JWard, KSmith, BLevy, MCummings, MDHaltiwanger, RCTrescher, GWang, BHemling, MEQuinn, CJCheng, HYLin, FSmith, WWJanson, CAZhao, BMcQueney, MSD'Alessio, KLee, CPMarzulli, ADodds, RABlake, SHwang, SMJames, IEGress, CJBradley, BRLark, MWGowen, MVeber, DF Azepanone-based inhibitors of human and rat cathepsin K. J Med Chem44:1380-95 (2001) Cathepsin K
Name:Cathepsin K
Type:Enzyme
Mol. Mass.:36975.68
Organism:Homo sapiens (Human)
Description:P43235
Residue:329
BDBM50098583
NameBDBM50098583
Synonyms:Benzofuran-2-carboxylic acid {1-[3-hydroxy-1-(pyridine-2-sulfonyl)-azepan-4-ylcarbamoyl]-3-methyl-butyl}-amide | CHEMBL287705
TypeSmall organic molecule
Emp. Form.C26H32N4O6S
Mol. Mass.528.62
SMILESCC(C)C[C@H](NC(=O)c1cc2ccccc2o1)C(=O)NC1CCCN(CC1O)S(=O)(=O)c1ccccn1