Reaction Details
TargetCathepsin S
LigandBDBM50066650
Substrate/Competitorn/a
Meas. Tech.ChEMBL_216712 (CHEMBL818677)
Ki 890±n/a nM
Citation Marquis, RWRu, YLoCastro, SMZeng, JYamashita, DSOh, HJErhard, KFDavis, LDTomaszek, TATew, DSalyers, KProksch, JWard, KSmith, BLevy, MCummings, MDHaltiwanger, RCTrescher, GWang, BHemling, MEQuinn, CJCheng, HYLin, FSmith, WWJanson, CAZhao, BMcQueney, MSD'Alessio, KLee, CPMarzulli, ADodds, RABlake, SHwang, SMJames, IEGress, CJBradley, BRLark, MWGowen, MVeber, DF Azepanone-based inhibitors of human and rat cathepsin K. J Med Chem44:1380-95 (2001) Cathepsin S
Name:Cathepsin S
Type:Protein
Mol. Mass.:37507.38
Organism:Homo sapiens (Human)
Description:P25774
Residue:331
BDBM50066650
NameBDBM50066650
Synonyms:1,3-BIS[[N-[(PHENYLMETHOXY)CARBONYL]-L-LEUCYL]AMINO]-2-PROPANONE {(S)-1-[3-((S)-2-Benzyloxycarbonylamino-4-methyl-pentanoylamino)-2-oxo-propylcarbamoyl]-3-methyl-butyl}-carbamic acid benzyl ester | {1-[3-(2-Benzyloxycarbonylamino-4-methyl-pentanoylamino)-2-oxo-propylcarbamoyl]-3-methyl-butyl}-carbamic acid benzyl ester
TypeSmall organic molecule
Emp. Form.C31H42N4O7
Mol. Mass.582.6878
SMILESCC(C)C[C@H](NC(=O)OCc1ccccc1)C(=O)NCC(=O)CNC(=O)[C@H](CC(C)C)NC(=O)OCc1ccccc1