Reaction Details
TargetCarbonyl reductase [NADPH] 1
LigandBDBM50543399
Substrate/Competitorn/a
Meas. Tech.ChEMBL_1989079 (CHEMBL4622626)
IC50 270±n/a nM
Citation Endo, SOguri, HSegawa, JKawai, MHu, DXia, SOkada, TIrie, KFujii, SGouda, HIguchi, KMatsukawa, TFujimoto, NNakayama, TToyooka, NMatsunaga, TIkari, A Development of Novel AKR1C3 Inhibitors as New Potential Treatment for Castration-Resistant Prostate Cancer. J Med Chem63:10396-10411 (2020) 
 
Carbonyl reductase [NADPH] 1
Name:Carbonyl reductase [NADPH] 1
Type:PROTEIN
Mol. Mass.:30380.63
Organism:Homo sapiens (Human)
Description:ChEMBL_607770
Residue:277
BDBM50543399
NameBDBM50543399
Synonyms:CHEMBL4648793
TypeSmall organic molecule
Emp. Form.C17H14N2O3
Mol. Mass.294.3047
SMILESCc1ccc(NC(=O)c2cc3cccc(O)c3oc2=N)cc1