Reaction Details
TargetCarbonyl reductase [NADPH] 1
LigandBDBM50543402
Substrate/Competitorn/a
Meas. Tech.ChEMBL_1989079 (CHEMBL4622626)
IC50 370±n/a nM
Citation Endo, SOguri, HSegawa, JKawai, MHu, DXia, SOkada, TIrie, KFujii, SGouda, HIguchi, KMatsukawa, TFujimoto, NNakayama, TToyooka, NMatsunaga, TIkari, A Development of Novel AKR1C3 Inhibitors as New Potential Treatment for Castration-Resistant Prostate Cancer. J Med Chem63:10396-10411 (2020) 
 
Carbonyl reductase [NADPH] 1
Name:Carbonyl reductase [NADPH] 1
Type:PROTEIN
Mol. Mass.:30380.63
Organism:Homo sapiens (Human)
Description:ChEMBL_607770
Residue:277
BDBM50543402
NameBDBM50543402
Synonyms:CHEMBL4634960
TypeSmall organic molecule
Emp. Form.C16H11FN2O3
Mol. Mass.298.2685
SMILESOc1cccc2cc(C(=O)Nc3cccc(F)c3)c(=N)oc12