Reaction Details
TargetPeroxisome proliferator-activated receptor delta
LigandBDBM50106105
Substrate/Competitorn/a
Meas. Tech.ChEBML_154542
EC50 19±n/a nM
Citation Liu, KGLambert, MHLeesnitzer, LMOliver, WOtt, RJPlunket, KDStuart, LWBrown, PJWillson, TMSternbach, DD Identification of a series of PPAR gamma/delta dual agonists via solid-phase parallel synthesis. Bioorg Med Chem Lett11:2959-62 (2001) Peroxisome proliferator-activated receptor delta
Name:Peroxisome proliferator-activated receptor delta
Type:PROTEIN
Mol. Mass.:49719.14
Organism:Mus musculus
Description:ChEMBL_1288931
Residue:440
BDBM50106105
NameBDBM50106105
Synonyms:2-[3-(3-{(2,4-Bis-trifluoromethyl-benzyl)-[2-(4-trifluoromethyl-phenyl)-acetyl]-amino}-propyl)-phenoxy]-2-methyl-propionic acid | CHEMBL102004
TypeSmall organic molecule
Emp. Form.C31H28F9NO4
Mol. Mass.649.5439
SMILESCC(C)(Oc1cccc(CCCN(Cc2ccc(cc2C(F)(F)F)C(F)(F)F)C(=O)Cc2ccc(cc2)C(F)(F)F)c1)C(O)=O