Reaction Details
TargetHistamine H3 receptor
LigandBDBM50112010
Substrate/Competitorn/a
Meas. Tech.ChEBML_85849
Ki 18±n/a nM
Citation Aslanian, RMutahi, MWShih, NYMcCormick, KDPiwinski, JJTing, PCAlbanese, MMBerlin, MYZhu, XWong, SCRosenblum, SBJiang, YWest, RShe, SWilliams, SMBryant, MHey, JA Identification of a novel, orally bioavailable histamine H(3) receptor antagonist based on the 4-benzyl-(1H-imidazol-4-yl) template. Bioorg Med Chem Lett12:937-41 (2002) Histamine H3 receptor
Name:Histamine H3 receptor
Type:Enzyme Catalytic Domain
Mol. Mass.:48753.61
Organism:GUINEA PIG
Description:HISTAMINE H3 HRH3 GUINEA PIG::Q9JI35
Residue:445
BDBM50112010
NameBDBM50112010
Synonyms:1-[4-(1H-Imidazol-4-ylmethyl)-benzyl]-3-(3-methoxy-phenyl)-urea | CHEMBL173599
TypeSmall organic molecule
Emp. Form.C19H20N4O2
Mol. Mass.336.3877
SMILESCOc1cccc(NC(=O)NCc2ccc(Cc3cnc[nH]3)cc2)c1