Reaction Details
TargetInterstitial collagenase
LigandBDBM50113021
Substrate/Competitorn/a
Meas. Tech.ChEBML_105983
IC50 23000±n/a nM
Citation Letavic, MAAxt, MZBarberia, JTCarty, TJDanley, DEGeoghegan, KFHalim, NSHoth, LRKamath, AVLaird, ERLopresti-Morrow, LLMcClure, KFMitchell, PGNatarajan, VNoe, MCPandit, JReeves, LSchulte, GKSnow, SLSweeney, FJTan, DHYu, CH Synthesis and biological activity of selective pipecolic acid-based TNF-alpha converting enzyme (TACE) inhibitors. Bioorg Med Chem Lett12:1387-90 (2002) Interstitial collagenase
Name:Interstitial collagenase
Type:Enzyme
Mol. Mass.:54010.26
Organism:Homo sapiens (Human)
Description: P03956
Residue:469
BDBM50113021
NameBDBM50113021
Synonyms:(2R,4S)-1-[4-(3-Cyano-benzyloxy)-benzenesulfonyl]-4-hydroxy-piperidine-2-carboxylic acid hydroxyamide | CHEMBL29217
TypeSmall organic molecule
Emp. Form.C20H21N3O6S
Mol. Mass.431.462
SMILESONC(=O)[C@H]1C[C@@H](O)CCN1S(=O)(=O)c1ccc(OCc2cccc(c2)C#N)cc1