Reaction Details
TargetDisintegrin and metalloproteinase domain-containing protein 17
LigandBDBM50113024
Substrate/Competitorn/a
Meas. Tech.ChEMBL_212741 (CHEMBL816559)
IC50 14±n/a nM
Citation Letavic, MAAxt, MZBarberia, JTCarty, TJDanley, DEGeoghegan, KFHalim, NSHoth, LRKamath, AVLaird, ERLopresti-Morrow, LLMcClure, KFMitchell, PGNatarajan, VNoe, MCPandit, JReeves, LSchulte, GKSnow, SLSweeney, FJTan, DHYu, CH Synthesis and biological activity of selective pipecolic acid-based TNF-alpha converting enzyme (TACE) inhibitors. Bioorg Med Chem Lett12:1387-90 (2002) Disintegrin and metalloproteinase domain-containing protein 17
Name:Disintegrin and metalloproteinase domain-containing protein 17
Type:Enzyme
Mol. Mass.:93007.89
Organism:Homo sapiens (Human)
Description:
Residue:824
BDBM50113024
NameBDBM50113024
Synonyms:(2R,4S)-1-[4-(4-Fluoro-benzyloxy)-benzenesulfonyl]-4-hydroxy-piperidine-2-carboxylic acid hydroxyamide | CHEMBL285591
TypeSmall organic molecule
Emp. Form.C19H21FN2O6S
Mol. Mass.424.443
SMILESONC(=O)[C@H]1C[C@@H](O)CCN1S(=O)(=O)c1ccc(OCc2ccc(F)cc2)cc1