Reaction Details
TargetDisintegrin and metalloproteinase domain-containing protein 17
LigandBDBM50113029
Substrate/Competitorn/a
Meas. Tech.ChEMBL_212741 (CHEMBL816559)
IC50 120±n/a nM
Citation Letavic, MAAxt, MZBarberia, JTCarty, TJDanley, DEGeoghegan, KFHalim, NSHoth, LRKamath, AVLaird, ERLopresti-Morrow, LLMcClure, KFMitchell, PGNatarajan, VNoe, MCPandit, JReeves, LSchulte, GKSnow, SLSweeney, FJTan, DHYu, CH Synthesis and biological activity of selective pipecolic acid-based TNF-alpha converting enzyme (TACE) inhibitors. Bioorg Med Chem Lett12:1387-90 (2002) Disintegrin and metalloproteinase domain-containing protein 17
Name:Disintegrin and metalloproteinase domain-containing protein 17
Type:Enzyme
Mol. Mass.:93007.89
Organism:Homo sapiens (Human)
Description:
Residue:824
BDBM50113029
NameBDBM50113029
Synonyms:(2R,4R)-1-[4-(4-Fluoro-phenoxy)-benzenesulfonyl]-2-hydroxycarbamoyl-piperidine-4-carboxylic acid methyl ester | CHEMBL286772
TypeSmall organic molecule
Emp. Form.C20H21FN2O7S
Mol. Mass.452.453
SMILESCOC(=O)[C@@H]1CCN([C@H](C1)C(=O)NO)S(=O)(=O)c1ccc(Oc2ccc(F)cc2)cc1