Reaction Details
TargetDisintegrin and metalloproteinase domain-containing protein 17
LigandBDBM50113021
Substrate/Competitorn/a
Meas. Tech.ChEMBL_90053 (CHEMBL701924)
IC50 33000±n/a nM
Citation Letavic, MAAxt, MZBarberia, JTCarty, TJDanley, DEGeoghegan, KFHalim, NSHoth, LRKamath, AVLaird, ERLopresti-Morrow, LLMcClure, KFMitchell, PGNatarajan, VNoe, MCPandit, JReeves, LSchulte, GKSnow, SLSweeney, FJTan, DHYu, CH Synthesis and biological activity of selective pipecolic acid-based TNF-alpha converting enzyme (TACE) inhibitors. Bioorg Med Chem Lett12:1387-90 (2002) Disintegrin and metalloproteinase domain-containing protein 17
Name:Disintegrin and metalloproteinase domain-containing protein 17
Type:Enzyme
Mol. Mass.:93007.89
Organism:Homo sapiens (Human)
Description:
Residue:824
BDBM50113021
NameBDBM50113021
Synonyms:(2R,4S)-1-[4-(3-Cyano-benzyloxy)-benzenesulfonyl]-4-hydroxy-piperidine-2-carboxylic acid hydroxyamide | CHEMBL29217
TypeSmall organic molecule
Emp. Form.C20H21N3O6S
Mol. Mass.431.462
SMILESONC(=O)[C@H]1C[C@@H](O)CCN1S(=O)(=O)c1ccc(OCc2cccc(c2)C#N)cc1